{"text_format":"1","workbook":"xlsx","n_sheets":15,"sheets":["Payback Estimator-4400B","Internal Rate of Return-4400B","O&M Cost Estimator 4400B","4400B Maint Item Description","MSRP-4 Yr Maint Schd  4400B","20yr Maintenance Schd- 4400B","Dropdown Menu","Payback Estimator-6500B","Internal Rate of Return-6500B","O&M Cost Estimator 6500B","6500B Maint. Item Description","MSRP-4 Yr Maintenance Scd 6500B","20yr Maintenance Schd- 6500B","release notes","Sheet1"],"not_rendered":{"charts":0,"images":12,"macros":1,"external_links":0,"defined_names":39,"comments":1,"pivot_tables":0},"unopened":[],"bounds":{"document_bytes":16777216,"sheet_cells":100000,"rows_first":2000,"rows_last":500,"rows_between":2000,"halvings":0,"cell_chars":16384,"cell_head_chars":4096},"cells_cut":0,"cells_raw":0,"read":"whole","date_system":"1900"}

{"sheet":"Payback Estimator-4400B","index":0,"n_rows":51,"n_cols":9,"rows_kept":51,"cut":false,"hidden":false,"merged":[[50,3,50,4],[1,3,1,4],[2,3,2,4],[45,3,45,4],[46,3,46,4],[47,3,47,4],[48,3,48,4],[49,0,49,4],[40,3,40,4],[41,3,41,4],[42,3,42,4],[43,3,43,4],[44,3,44,4],[35,3,35,4],[36,3,36,4],[37,3,37,4],[38,3,38,4],[39,3,39,4],[30,3,30,4],[31,3,31,4],[32,3,32,4],[33,3,33,4],[34,3,34,4],[25,3,25,4],[26,3,26,4],[27,3,27,4],[28,3,28,4],[29,3,29,4],[20,3,20,4],[21,3,21,4],[22,3,22,4],[23,3,23,4],[24,3,24,4],[15,3,15,4],[16,3,16,4],[17,3,17,4],[18,3,18,4],[19,3,19,4],[3,3,3,4],[4,3,4,4],[5,3,5,4],[6,3,6,4],[7,3,7,4],[8,3,8,4],[9,3,9,4],[10,3,10,4],[11,3,11,4],[12,3,12,4],[13,3,13,4],[14,3,14,4]]}
[null,null,"$","Single Currency"]
[null,null,{"$f":"\"$ x \" & C3 & \" = \" & G12","v":"$ x 1 = $"},"CONFIDENTIAL"]
[null,"$ U.S. Dollars",1,"Payback Estimator"]
["POWER+ GENERATOR 4400B+ System Package",{"$f":"C4/$C$3","v":145000},145000,"4400B+ POWER+ GENERATOR High Temperature",null,null,"List fill range for currency selection - linked only to visible drop-down menu on main page.","List fill range for currency display"]
["    Liquid Loop Radiator (LLR)",{"$f":"C5*(1/$C$3)","v":45000},45000,"Liquid Loop Radiator size for location ambient and thermal duty",null,null,"$","Single Currency",5]
["    In-rush Reduction System",0,null,"In-rush Reduction System per local codes  (estimated costs)",null,null,"€","Dual Currency",5]
["    LLR interconnect plumbing",0,null,"Refrigerant plumbing, piping, valves, and assembly",null,null,"£",null,5]
["    Water plumbing",10000,10000,"Plumbing, piping, connections, valves and assembly (estimated costs)",null,null,"¥","Single Currency",5]
{"$rows_left_out":44}
{"sheet":"Internal Rate of Return-4400B","index":1,"n_rows":111,"n_cols":20,"rows_kept":111,"cut":false,"hidden":false,"merged":[[109,0,109,15],[106,1,106,3],[108,1,108,3],[110,0,110,2]]}
[null,null,null,null,null,null,"  Payback Estimator"]
["POWER+ 4400B IRR calculation(USD)",null,null,null,null,null,"  CONFIDENTIAL",null,"POWER+ 4400B IRR calculation(EUR)"]
[null,null,null,null,null,null,"  Copyright © 2020 ElectraTherm "]
["Year:","Capital Expenditure  [Capex] ($)","Annual maintenance costs  (estimated) ($)","Annual income from kwh produced ($)","Net cash flow ($)","Cumulative return ($)","IRR",null,"Year:","Capital Expenditure  [Capex] (€)","Annual maintenance costs  (estimated) (€)","Annual income from kwh produced (€)","Net cash flow (€)","Cumulative return (€)","IRR",null,null,null,"payback"]
[0,{"$f":"-'Payback Estimator-4400B'!B33","v":-178710},null,null,{"$f":"SUM(B5)","v":-178710},{"$f":"SUM(B5)","v":-178710},null,null,0,{"$f":"-'Payback Estimator-4400B'!C33","v":-178710},null,null,{"$f":"SUM(J5)","v":-178710},{"$f":"SUM(J5)","v":-178710},null,null,null,null,99999,{"$f":"MIN(S5:S105)","v":3.8947686725128512}]
[1,null,{"$f":"-LOOKUP(((A6*'O&M Cost Estimator 4400B'!F$7)-MOD((A6*'O&M Cost Estimator 4400B'!F$7),4400)),'O&M Cost Estimator 4400B'!F21:F80,'O&M Cost Estimator 4400B'!I21:I80)-LOOKUP(((A6*'O&M Cost Estimator 4400B'!F$7)-MOD((A6*'O&M Cost Estimator 4400B'!F$7),4400)),'O&M Cost Estimator 4400B'!F21:F80,'O&M Cost Estimator 4400B'!K21:K80)","v":-287},{"$f":"'Payback Estimator-4400B'!$B$39","v":46734.6},{"$f":"C6+D6","v":46447.6},{"$f":"SUM($E$5:E6)","v":-132262.39999999999},{"$f":"IRR($E$5:E6)","v":-0.74009512618208273},null,1,null,{"$f":"-LOOKUP(((A6*'O&M Cost Estimator 4400B'!F$7)-MOD((A6*'O&M Cost Estimator 4400B'!F$7),4400)),'O&M Cost Estimator 4400B'!P21:P80,'O&M Cost Estimator 4400B'!S21:S80)-LOOKUP(((A6*'O&M Cost Estimator 4400B'!F$7)-MOD((A6*'O&M Cost Estimator 4400B'!F$7),4400)),'O&M Cost Estimator 4400B'!P21:P80,'O&M Cost Estimator 4400B'!U21:U80)","v":-287},{"$f":"'Payback Estimator-4400B'!$C$39","v":46734.6},{"$f":"K6+L6","v":46447.6},{"$f":"SUM($M$5:M6)","v":-132262.39999999999},{"$f":"IRR($M$5:M6)","v":-0.74009512618208273},null,null,null,{"$f":"IF(S5=99999,IF(F6>=0,A6-F6/E6,99999),99998)","v":99999}]
[2,null,{"$f":"-LOOKUP(((A7*'O&M Cost Estimator 4400B'!F$7)-MOD((A7*'O&M Cost Estimator 4400B'!F$7),4400)),'O&M Cost Estimator 4400B'!F$21:F$80,'O&M Cost Estimator 4400B'!I$21:I$80)-LOOKUP(((A7*'O&M Cost Estimator 4400B'!F$7)-MOD((A7*'O&M Cost Estimator 4400B'!F$7),4400)),'O&M Cost Estimator 4400B'!F$21:F$80,'O&M Cost Estimator 4400B'!K$21:K$80)+LOOKUP(((A6*'O&M Cost Estimator 4400B'!F$7)-MOD((A6*'O&M Cost Estimator 4400B'!F$7),4400)),'O&M Cost Estimator 4400B'!F$21:F$80,'O&M Cost Estimator 4400B'!I$21:I$80)+LOOKUP(((A6*'O&M Cost Estimator 4400B'!F$7)-MOD((A6*'O&M Cost Estimator 4400B'!F$7),4400)),'O&M Cost Estimator 4400B'!F$21:F$80,'O&M Cost Estimator 4400B'!K$21:K$80)","v":-742},{"$f":"'Payback Estimator-4400B'!$B$43*('Payback Estimator-4400B'!$B$39) +D6","v":46734.6},45992.6,{"$f":"SUM($E$5:E7)","v":-86269.799999999988},{"$f":"IRR($E$5:E7)","v":-0.34636207981759803},null,2,null,{"$f":"-LOOKUP(((A7*'O&M Cost Estimator 4400B'!F$7)-MOD((A7*'O&M Cost Estimator 4400B'!F$7),4400)),'O&M Cost Estimator 4400B'!P$21:P$80,'O&M Cost Estimator 4400B'!S$21:S$80)-LOOKUP(((A7*'O&M Cost Estimator 4400B'!F$7)-MOD((A7*'O&M Cost Estimator 4400B'!F$7),4400)),'O&M Cost Estimator 4400B'!P$21:P$80,'O&M Cost Estimator 4400B'!U$21:U$80)+LOOKUP(((A6*'O&M Cost Estimator 4400B'!F$7)-MOD((A6*'O&M Cost Estimator 4400B'!F$7),4400)),'O&M Cost Estimator 4400B'!P$21:P$80,'O&M Cost Estimator 4400B'!S$21:S$80)+LOOKUP(((A6*'O&M Cost Estimator 4400B'!F$7)-MOD((A6*'O&M Cost Estimator 4400B'!F$7),4400)),'O&M Cost Estimator 4400B'!P$21:P$80,'O&M Cost Estimator 4400B'!U$21:U$80)","v":-742},{"$f":"'Payback Estimator-4400B'!$C$43*('Payback Estimator-4400B'!$C$39)+L6","v":46734.6},45992.6,{"$f":"SUM($M$5:M7)","v":-86269.799999999988},{"$f":"IRR($M$5:M7)","v":-0.34636207981759803},null,null,null,99999]
[3,null,{"$f":"-LOOKUP(((A8*'O&M Cost Estimator 4400B'!F$7)-MOD((A8*'O&M Cost Estimator 4400B'!F$7),4400)),'O&M Cost Estimator 4400B'!F$21:F$80,'O&M Cost Estimator 4400B'!I$21:I$80)-LOOKUP(((A8*'O&M Cost Estimator 4400B'!F$7)-MOD((A8*'O&M Cost Estimator 4400B'!F$7),4400)),'O&M Cost Estimator 4400B'!F$21:F$80,'O&M Cost Estimator 4400B'!K$21:K$80)+LOOKUP(((A7*'O&M Cost Estimator 4400B'!F$7)-MOD((A7*'O&M Cost Estimator 4400B'!F$7),4400)),'O&M Cost Estimator 4400B'!F$21:F$80,'O&M Cost Estimator 4400B'!I$21:I$80)+LOOKUP(((A7*'O&M Cost Estimator 4400B'!F$7)-MOD((A7*'O&M Cost Estimator 4400B'!F$7),4400)),'O&M Cost Estimator 4400B'!F$21:F$80,'O&M Cost Estimator 4400B'!K$21:K$80)","v":-1299},{"$f":"'Payback Estimator-4400B'!$B$43*(D7) +D7","v":46734.6},45435.6,{"$f":"SUM($E$5:E8)","v":-40834.19999999999},{"$f":"IRR($E$5:E8)","v":-0.11967922013522581},null,3,null,{"$f":"-LOOKUP(((A8*'O&M Cost Estimator 4400B'!F$7)-MOD((A8*'O&M Cost Estimator 4400B'!F$7),4400)),'O&M Cost Estimator 4400B'!P$21:P$80,'O&M Cost Estimator 4400B'!S$21:S$80)-LOOKUP(((A8*'O&M Cost Estimator 4400B'!F$7)-MOD((A8*'O&M Cost Estimator 4400B'!F$7),4400)),'O&M Cost Estimator 4400B'!P$21:P$80,'O&M Cost Estimator 4400B'!U$21:U$80)+LOOKUP(((A7*'O&M Cost Estimator 4400B'!F$7)-MOD((A7*'O&M Cost Estimator 4400B'!F$7),4400)),'O&M Cost Estimator 4400B'!P$21:P$80,'O&M Cost Estimator 4400B'!S$21:S$80)+LOOKUP(((A7*'O&M Cost Estimator 4400B'!F$7)-MOD((A7*'O&M Cost Estimator 4400B'!F$7),4400)),'O&M Cost Estimator 4400B'!P$21:P$80,'O&M Cost Estimator 4400B'!U$21:U$80)","v":-1299},{"$f":"'Payback Estimator-4400B'!$C$43*(L7)+L7","v":46734.6},45435.6,{"$f":"SUM($M$5:M8)","v":-40834.19999999999},{"$f":"IRR($M$5:M8)","v":-0.11967922013522581},null,null,null,99999]
{"$rows_left_out":104}
{"sheet":"O&M Cost Estimator 4400B","index":2,"n_rows":65,"n_cols":21,"rows_kept":65,"cut":false,"hidden":false,"merged":[[29,2,30,2],[31,2,32,2],[33,2,34,2],[59,12,60,12],[39,2,40,2],[41,2,42,2],[43,2,44,2],[45,2,46,2],[47,2,48,2],[29,12,30,12],[31,12,32,12],[33,12,34,12],[35,12,36,12],[37,12,38,12],[35,2,36,2],[37,2,38,2],[63,2,63,20],[49,2,50,2],[51,2,52,2],[53,2,54,2],[55,2,56,2],[57,2,58,2],[59,2,60,2],[18,12,18,20],[21,2,22,2],[23,2,24,2],[25,2,26,2],[27,2,28,2],[25,12,26,12],[27,12,28,12],[18,2,18,10],[12,7,12,12],[1,4,2,12],[5,7,5,12],[6,5,6,6],[6,7,6,12],[7,5,7,6],[8,5,8,6],[8,7,8,12],[9,5,9,6],[9,7,9,12],[10,5,10,6],[10,7,10,12],[11,7,11,12],[64,2,64,6],[39,12,40,12],[13,7,13,12],[14,7,14,12],[15,7,15,12],[21,12,22,12],[23,12,24,12],[41,12,42,12],[43,12,44,12],[45,12,46,12],[47,12,48,12],[49,12,50,12],[51,12,52,12],[53,12,54,12],[55,12,56,12],[57,12,58,12]]}
[null,null,null,null,null,null,null,null,null,null,null,null,null,null,"  Payback Estimator"]
[null,null,null,null,null,null,null,null,null,null,null,null,null,null,"  CONFIDENTIAL"]
[null,null,null,null,null,null,null,null,null,null,null,null,null,null,"  Copyright © 2020 ElectraTherm "]
[]
[null,null,null,null,null,"USD","EU",null,null,null,null,null,null,null,null,{"$f":"'Payback Estimator-4400B'!C3","v":1},"conversion rate","<--- this is set by the conversion rate on S4000B payback estimator page)"]
[null,null,null,null,"USER INPUT=>",56,{"$f":"F6*$P$5","v":56},"estimated cost of labor per hour for maintenance"]
[null,null,null,null,null,{"$f":"'Payback Estimator-4400B'!B35*8760","v":8497.1999999999989},null,"Uptime hours per year(4400 min/ 8760 max)--from S4400B payback estimator"]
[null,null,null,null,null,{"$f":"'Payback Estimator-4400B'!C42","v":20},null,"P+ lifetime in years (from payback estimator)"]
{"$rows_left_out":58}
{"sheet":"4400B Maint Item Description","index":3,"n_rows":36,"n_cols":9,"rows_kept":36,"cut":false,"hidden":false,"merged":[[33,1,33,8],[29,1,30,8],[28,1,28,4],[31,1,31,6]]}
[]
[]
[]
[]
[]
[null,"POWER+ 4400B End User Maintenance Item Descriptions:"]
[]
[]
{"$rows_left_out":29}
{"sheet":"MSRP-4 Yr Maint Schd  4400B","index":4,"n_rows":31,"n_cols":26,"rows_kept":31,"cut":false,"hidden":false,"merged":[[6,20,6,25],[8,2,8,4],[8,5,8,7],[8,8,8,10],[8,11,8,13],[8,14,8,16],[8,17,8,19],[8,20,8,22],[8,23,8,25],[6,2,6,7],[6,8,6,13],[6,14,6,19],[7,2,7,4],[7,5,7,7],[27,13,27,16],[27,17,27,19],[29,1,29,19],[7,23,7,25],[7,20,7,22],[7,8,7,10],[7,11,7,13],[7,14,7,16],[7,17,7,19],[26,13,26,16],[26,17,26,19]]}
[]
[]
[]
[null,"POWER+ 4400B: 4 Year End User Routine Maintenance Schedule"]
[]
[null,null,"CUMULATIVE RUN TIME HOURS"]
[null,null,"1 YEAR(8760 HOURS PER YEAR)",null,null,null,null,null,"2 YEARS(8760 HOURS PER YEAR)",null,null,null,null,null,"3 YEARS(8760 HOURS PER YEAR)",null,null,null,null,null,"4 YEARS(8760 HOURS PER YEAR)"]
[null,null,"4400HR SERVICE ITEMS",null,null,"8800HR SERVICE ITEMS",null,null,"13200HR SERVICE ITEMS",null,null,"17600HR SERVICE ITEMS",null,null,"22000HR SERVICE ITEMS",null,null,"26400HR SERVICE ITEMS",null,null,"30800 SERVICE ITEMS",null,null,"35200 SERVICE ITEMS"]
{"$rows_left_out":24}
{"sheet":"20yr Maintenance Schd- 4400B","index":5,"n_rows":45,"n_cols":27,"rows_kept":45,"cut":false,"hidden":false,"merged":[[21,20,21,21],[21,22,21,23],[40,1,43,23],[18,4,18,27],[21,2,21,3],[21,4,21,5],[21,6,21,7],[21,8,21,9],[21,10,21,11],[21,12,21,13],[21,14,21,15],[21,16,21,17],[21,18,21,19],[1,3,1,55],[3,2,3,3],[3,4,3,5],[3,6,3,7],[3,8,3,9],[3,10,3,11],[3,12,3,13],[3,14,3,15],[3,16,3,17],[3,18,3,19]]}
[null,"POWER+ 4400B: 20 Year End User Maintenance Schedule"]
[null,null,null,"                       CUMULATIVE RUN TIME HOURS ON POWER+ GENERATOR"]
[null,null,4400,{"$f":"4400+C3","v":8800},{"$f":"4400+D3","v":13200},17600,22000,26400,30800,35200,39600,44000,48400,52800,57200,61600,66000,70400,74800,79200]
[null,"REQUIRED SERVICE WORK","1 year",null,"2 years",null,"3 years",null,"4 years",null,"5 years",null,"6 years",null,"7 years",null,"8 years",null,"9 years"]
[null,{"$f":"'4400B Maint Item Description'!B10","v":"Inspect all plumbing, flanges, and valves for leaks"},"♦","♦","♦","♦","♦","♦","♦","♦","♦","♦","♦","♦","♦","♦","♦","♦","♦","♦"]
[null,{"$f":"'4400B Maint Item Description'!B11","v":"Inspect hardware for wear/damage"},"♦","♦","♦","♦","♦","♦","♦","♦","♦","♦","♦","♦","♦","♦","♦","♦","♦","♦"]
[null,{"$f":"'4400B Maint Item Description'!B12","v":"Grease pump motor bearings"},"♦","♦","♦","♦","♦","♦","♦","♦","♦","♦","♦","♦","♦","♦","♦","♦","♦","♦"]
[null,{"$f":"'4400B Maint Item Description'!B13","v":"Clean cabinet heat exchanger"},"♦","♦","♦","♦","♦","♦","♦","♦","♦","♦","♦","♦","♦","♦","♦","♦","♦","♦"]
{"$rows_left_out":38}
{"sheet":"Dropdown Menu","index":6,"n_rows":50,"n_cols":5,"rows_kept":50,"cut":false,"hidden":true,"merged":[[37,1,40,1],[37,2,40,2],[26,2,28,2],[31,2,33,2],[26,1,28,1],[4,4,8,4],[10,4,13,4],[31,1,33,1]]}
[]
[]
[null,"4400B","6500B"]
[null,"Line #","Line #"]
[null,"4 / column  A",null,"Active Cooler (AC800)","4400B"]
[null,null,null,"POWER+ GENERATOR 4400B Power+"]
[null,null,null,"POWER+ GENERATOR 4400B System Package"]
[null,null,null,"POWER+ GENERATOR 4400B+ Power+"]
{"$rows_left_out":43}
{"sheet":"Payback Estimator-6500B","index":7,"n_rows":50,"n_cols":9,"rows_kept":50,"cut":false,"hidden":false,"merged":[[3,3,3,4],[4,3,4,4],[5,3,5,4],[6,3,6,4],[7,3,7,4],[8,3,8,4],[9,3,9,4],[10,3,10,4],[11,3,11,4],[12,3,12,4],[16,3,16,4],[13,3,13,4],[20,3,20,4],[14,3,14,4],[15,3,15,4],[17,3,17,4],[18,3,18,4],[19,3,19,4],[28,3,28,4],[29,3,29,4],[30,3,30,4],[21,3,21,4],[22,3,22,4],[23,3,23,4],[24,3,24,4],[25,3,25,4],[48,0,48,4],[45,3,45,4],[46,3,46,4],[47,3,47,4],[43,3,43,4],[44,3,44,4],[1,3,1,4],[2,3,2,4],[40,3,40,4],[41,3,41,4],[42,3,42,4],[35,3,35,4],[36,3,36,4],[37,3,37,4],[38,3,38,4],[39,3,39,4],[31,3,31,4],[32,3,32,4],[33,3,33,4],[34,3,34,4],[26,3,26,4],[27,3,27,4]]}
[null,null,"$","Single Currency"]
[null,null,{"$f":" \"$ x \" & ROUND(C3,2) & \" = \" & G12","v":"$ x 1 = $"},"CONFIDENTIAL"]
[null,"$ U.S. Dollars",1,"Payback Estimator"]
["POWER+ GENERATOR 6500B+ System Package",{"$f":"C4/$C$3","v":178000},178000,"6500B+ POWER+ GENERATOR  High Temperature",null,null,"List fill range for currency selection - linked only to visible drop-down menu on main page.","List fill range for currency display"]
["    Liquid Loop Radiator (LLR)",{"$f":"C5*(1/$C$3)","v":55000},55000,"Liquid Loop Radiator size for location ambient and thermal duty",null,null,"$","Single Currency",5]
["    In-rush Reduction System",{"$f":"C6*(1/$C$3)","v":0},null,"In-rush Reduction System per local codes  (estimated costs)",null,null,"€","Dual Currency",5]
["    LLR interconnect plumbing",0,null,"Refrigerant plumbing, piping, valves, and assembly",null,null,"£",null,5]
["    Water plumbing & Pump",10000,10000,"Plumbing, piping, connections, valves and assembly (estimated costs)",null,null,"¥","Single Currency",5]
{"$rows_left_out":43}
{"sheet":"Internal Rate of Return-6500B","index":8,"n_rows":111,"n_cols":20,"rows_kept":111,"cut":false,"hidden":false,"merged":[[106,1,106,3],[108,1,108,3],[109,0,109,15]]}
[null,null,null,null,null,null,"  Payback Estimator"]
["POWER+ 6500B IRR calculation(USD)",null,null,null,null,null,"  CONFIDENTIAL",null,"POWER+ 6500B IRR calculation(EUR)"]
[null,null,null,null,null,null,"  Copyright © 2020 ElectraTherm "]
["Year:","Capital Expenditure  [Capex] ($)","Annual maintenance costs  (estimated) ($)","Annual income from kwh produced ($)","Net cash flow ($)","Cumulative return ($)","IRR",null,"Year:","Capital Expenditure  [Capex] ($)","Annual maintenance costs  (estimated) ($)","Annual income from kwh produced ($)","Net cash flow ($)","Cumulative return ($)","IRR",null,null,null,"payback"]
[0,{"$f":"-'Payback Estimator-6500B'!B32","v":-210530},null,null,{"$f":"SUM(B5)","v":-210530},{"$f":"SUM(B5)","v":-210530},null,null,0,{"$f":"-'Payback Estimator-6500B'!C32","v":-210530},null,null,{"$f":"SUM(J5)","v":-210530},{"$f":"SUM(J5)","v":-210530},null,null,null,null,99999,{"$f":"MIN(S5:S105)","v":2.5050625237743085}]
[1,null,{"$f":"-LOOKUP(((A6*'O&M Cost Estimator 6500B'!F$7)-MOD((A6*'O&M Cost Estimator 6500B'!F$7),4400)),'O&M Cost Estimator 6500B'!F21:F221,'O&M Cost Estimator 6500B'!I21:I221)-LOOKUP(((A6*'O&M Cost Estimator 6500B'!F$7)-MOD((A6*'O&M Cost Estimator 6500B'!F$7),4400)),'O&M Cost Estimator 6500B'!F21:F221,'O&M Cost Estimator 6500B'!K21:K221)","v":-282.5},{"$f":"'Payback Estimator-6500B'!$B$38","v":84971.999999999985},{"$f":"C6+D6","v":84689.499999999985},{"$f":"SUM($E$5:E6)","v":-125840.50000000001},{"$f":"IRR($E$5:E6)","v":-0.597731914691493},null,1,null,{"$f":"-LOOKUP(((A6*'O&M Cost Estimator 6500B'!F$7)-MOD((A6*'O&M Cost Estimator 6500B'!F$7),4400)),'O&M Cost Estimator 6500B'!Q21:Q221,'O&M Cost Estimator 6500B'!T21:T221)-LOOKUP(((A6*'O&M Cost Estimator 6500B'!F$7)-MOD((A6*'O&M Cost Estimator 6500B'!F$7),4400)),'O&M Cost Estimator 6500B'!Q21:Q221,'O&M Cost Estimator 6500B'!V21:V221)","v":-282.5},{"$f":"'Payback Estimator-6500B'!$C$38","v":84971.999999999985},{"$f":"K6+L6","v":84689.499999999985},{"$f":"SUM($M$5:M6)","v":-125840.50000000001},{"$f":"IRR($M$5:M6)","v":-0.597731914691493},null,null,null,{"$f":"IF(S5=99999,IF(F6>=0,A6-F6/E6,99999),99998)","v":99999}]
[2,null,{"$f":"-LOOKUP(((A7*'O&M Cost Estimator 6500B'!F$7)-MOD((A7*'O&M Cost Estimator 6500B'!F$7),4400)),'O&M Cost Estimator 6500B'!F$21:F$221,'O&M Cost Estimator 6500B'!I$21:I$221)-LOOKUP(((A7*'O&M Cost Estimator 6500B'!F$7)-MOD((A7*'O&M Cost Estimator 6500B'!F$7),4400)),'O&M Cost Estimator 6500B'!F$21:F$221,'O&M Cost Estimator 6500B'!K$21:K$221)+LOOKUP(((A6*'O&M Cost Estimator 6500B'!F$7)-MOD((A6*'O&M Cost Estimator 6500B'!F$7),4400)),'O&M Cost Estimator 6500B'!F$21:F$221,'O&M Cost Estimator 6500B'!I$21:I$221)+LOOKUP(((A6*'O&M Cost Estimator 6500B'!F$7)-MOD((A6*'O&M Cost Estimator 6500B'!F$7),4400)),'O&M Cost Estimator 6500B'!F$21:F$221,'O&M Cost Estimator 6500B'!K$21:K$221)","v":-730},{"$f":"'Payback Estimator-6500B'!$B$42*('Payback Estimator-6500B'!$B$38) +D6","v":84971.999999999985},84241.999999999985,{"$f":"SUM($E$5:E7)","v":-41598.500000000029},{"$f":"IRR($E$5:E7)","v":-0.13509084435885776},null,2,null,{"$f":"-LOOKUP(((A7*'O&M Cost Estimator 6500B'!F$7)-MOD((A7*'O&M Cost Estimator 6500B'!F$7),4400)),'O&M Cost Estimator 6500B'!Q$21:Q$221,'O&M Cost Estimator 6500B'!T$21:T$221)-LOOKUP(((A7*'O&M Cost Estimator 6500B'!F$7)-MOD((A7*'O&M Cost Estimator 6500B'!F$7),4400)),'O&M Cost Estimator 6500B'!Q$21:Q$221,'O&M Cost Estimator 6500B'!V$21:V$221)+LOOKUP(((A6*'O&M Cost Estimator 6500B'!F$7)-MOD((A6*'O&M Cost Estimator 6500B'!F$7),4400)),'O&M Cost Estimator 6500B'!Q$21:Q$221,'O&M Cost Estimator 6500B'!T$21:T$221)+LOOKUP(((A6*'O&M Cost Estimator 6500B'!F$7)-MOD((A6*'O&M Cost Estimator 6500B'!F$7),4400)),'O&M Cost Estimator 6500B'!Q$21:Q$221,'O&M Cost Estimator 6500B'!V$21:V$221)","v":-730},{"$f":"'Payback Estimator-6500B'!$C$42*('Payback Estimator-6500B'!$C$38)+L6","v":84971.999999999985},84241.999999999985,{"$f":"SUM($M$5:M7)","v":-41598.500000000029},{"$f":"IRR($M$5:M7)","v":-0.13509084435885776},null,null,null,99999]
[3,null,{"$f":"-LOOKUP(((A8*'O&M Cost Estimator 6500B'!F$7)-MOD((A8*'O&M Cost Estimator 6500B'!F$7),4400)),'O&M Cost Estimator 6500B'!F$21:F$221,'O&M Cost Estimator 6500B'!I$21:I$221)-LOOKUP(((A8*'O&M Cost Estimator 6500B'!F$7)-MOD((A8*'O&M Cost Estimator 6500B'!F$7),4400)),'O&M Cost Estimator 6500B'!F$21:F$221,'O&M Cost Estimator 6500B'!K$21:K$221)+LOOKUP(((A7*'O&M Cost Estimator 6500B'!F$7)-MOD((A7*'O&M Cost Estimator 6500B'!F$7),4400)),'O&M Cost Estimator 6500B'!F$21:F$221,'O&M Cost Estimator 6500B'!I$21:I$221)+LOOKUP(((A7*'O&M Cost Estimator 6500B'!F$7)-MOD((A7*'O&M Cost Estimator 6500B'!F$7),4400)),'O&M Cost Estimator 6500B'!F$21:F$221,'O&M Cost Estimator 6500B'!K$21:K$221)","v":-2608.9300000000003},{"$f":"'Payback Estimator-6500B'!$B$42*(D7) +D7","v":84971.999999999985},82363.069999999978,{"$f":"SUM($E$5:E8)","v":40764.569999999949},{"$f":"IRR($E$5:E8)","v":9.4468935969208578E-2},null,3,null,{"$f":"-LOOKUP(((A8*'O&M Cost Estimator 6500B'!F$7)-MOD((A8*'O&M Cost Estimator 6500B'!F$7),4400)),'O&M Cost Estimator 6500B'!Q$21:Q$221,'O&M Cost Estimator 6500B'!T$21:T$221)-LOOKUP(((A8*'O&M Cost Estimator 6500B'!F$7)-MOD((A8*'O&M Cost Estimator 6500B'!F$7),4400)),'O&M Cost Estimator 6500B'!Q$21:Q$221,'O&M Cost Estimator 6500B'!V$21:V$221)+LOOKUP(((A7*'O&M Cost Estimator 6500B'!F$7)-MOD((A7*'O&M Cost Estimator 6500B'!F$7),4400)),'O&M Cost Estimator 6500B'!Q$21:Q$221,'O&M Cost Estimator 6500B'!T$21:T$221)+LOOKUP(((A7*'O&M Cost Estimator 6500B'!F$7)-MOD((A7*'O&M Cost Estimator 6500B'!F$7),4400)),'O&M Cost Estimator 6500B'!Q$21:Q$221,'O&M Cost Estimator 6500B'!V$21:V$221)","v":-2608.9300000000003},{"$f":"'Payback Estimator-6500B'!$C$42*(L7)+L7","v":84971.999999999985},82363.069999999978,{"$f":"SUM($M$5:M8)","v":40764.569999999949},{"$f":"IRR($M$5:M8)","v":9.4468935969208578E-2},null,null,null,2.5050625237743085]
{"$rows_left_out":104}
{"sheet":"O&M Cost Estimator 6500B","index":9,"n_rows":224,"n_cols":22,"rows_kept":224,"cut":false,"hidden":false,"merged":[[45,13,46,13],[47,13,48,13],[59,13,60,13],[49,13,50,13],[51,13,52,13],[53,13,54,13],[55,13,56,13],[57,13,58,13],[55,2,56,2],[57,2,58,2],[59,2,60,2],[222,2,222,21],[21,13,22,13],[23,13,24,13],[25,13,26,13],[27,13,28,13],[29,13,30,13],[31,13,32,13],[33,13,34,13],[35,13,36,13],[37,13,38,13],[39,13,40,13],[41,13,42,13],[43,13,44,13],[45,2,46,2],[47,2,48,2],[49,2,50,2],[51,2,52,2],[53,2,54,2],[35,2,36,2],[37,2,38,2],[39,2,40,2],[41,2,42,2],[43,2,44,2],[25,2,26,2],[27,2,28,2],[29,2,30,2],[31,2,32,2],[33,2,34,2],[10,5,10,6],[18,13,18,21],[21,2,22,2],[23,2,24,2],[15,7,15,12],[18,2,18,10],[223,2,223,7],[261,4,261,21],[1,4,2,12],[5,7,5,12],[8,7,8,12],[10,7,10,12],[12,7,12,12],[14,7,14,12],[6,7,6,12],[9,7,9,12],[11,7,11,12],[13,7,13,12],[7,5,7,6],[6,5,6,6],[8,5,8,6],[9,5,9,6]]}
[null,null,null,null,null,null,null,null,null,null,null,null,null,null,null,"  Payback Estimator"]
[null,null,null,null,null,null,null,null,null,null,null,null,null,null,null,"  CONFIDENTIAL"]
[null,null,null,null,null,null,null,null,null,null,null,null,null,null,null,"  Copyright © 2020 ElectraTherm "]
[]
[null,null,null,null,null,"USD","EU",null,null,null,null,null,null,null,null,null,{"$f":"'Payback Estimator-6500B'!C3","v":1},"conversion rate","<--- this is set by the conversion rate on S6000 payback estimator page)"]
[null,null,null,null,"USER INPUT=>",55,{"$f":"F6*$Q$5","v":55},"estimated cost of labor per hour for maintenance"]
[null,null,null,null,null,{"$f":"'Payback Estimator-6500B'!B34*8760","v":8497.1999999999989},null,"uptime hours per year(4400 min/ 8760 max)--from S6000 payback estimator"]
[null,null,null,null,null,{"$f":"'Payback Estimator-6500B'!C41","v":20},null,"P+ lifetime in years (from payback estimator)"]
{"$rows_left_out":217}
{"sheet":"6500B Maint. Item Description","index":10,"n_rows":34,"n_cols":9,"rows_kept":34,"cut":false,"hidden":false,"merged":[[32,1,32,8],[28,1,29,8],[27,1,27,3],[30,1,30,6]]}
[]
[]
[]
[]
[]
[null,"POWER+ 6500B End User Maintenance Item Descriptions:"]
[]
[]
{"$rows_left_out":27}
{"sheet":"MSRP-4 Yr Maintenance Scd 6500B","index":11,"n_rows":32,"n_cols":26,"rows_kept":32,"cut":false,"hidden":false,"merged":[[6,20,6,25],[7,20,7,22],[7,23,7,25],[8,2,8,4],[8,5,8,7],[8,8,8,10],[8,11,8,13],[8,14,8,16],[8,17,8,19],[8,20,8,22],[8,23,8,25],[7,17,7,19],[28,13,28,16],[28,17,28,19],[30,1,30,17],[6,2,6,7],[6,8,6,13],[6,14,6,19],[27,13,27,16],[27,17,27,19],[7,2,7,4],[7,5,7,7],[7,8,7,10],[7,11,7,13],[7,14,7,16]]}
[]
[]
[]
[null,"POWER+ 6500B: 4 Year End User Routine Maintenance Schedule"]
[]
[null,null,"CUMULATIVE RUN TIME HOURS"]
[null,null,"1 YEAR(8760 HOURS PER YEAR)",null,null,null,null,null,"2 YEARS(8760 HOURS PER YEAR)",null,null,null,null,null,"3 YEARS(8760 HOURS PER YEAR)",null,null,null,null,null,"4 YEARS(8760 HOURS PER YEAR)"]
[null,null,"4400HR SERVICE ITEMS",null,null,"8800HR SERVICE ITEMS",null,null,"13200HR SERVICE ITEMS",null,null,"17600HR SERVICE ITEMS",null,null,"22000HR SERVICE ITEMS",null,null,"26400HR SERVICE ITEMS",null,null,"30800HR SERVICE ITEMS",null,null,"35200HR SERVICE ITEMS"]
{"$rows_left_out":25}
{"sheet":"20yr Maintenance Schd- 6500B","index":12,"n_rows":41,"n_cols":27,"rows_kept":41,"cut":false,"hidden":false,"merged":[[17,2,17,81],[36,1,39,23]]}
[null,"POWER+ 6500B: 20 Year End User Maintenance Schedule"]
[null,null,null,"                     CUMULATIVE RUN TIME HOURS"]
[null,"REQUIRED SERVICE WORK",4400,8800,13200,17600,22000,26400,30800,35200,39600,44000,48400,52800,57200,61600,66000,70400,74800,79200]
[null,"Inspect all plumbing, flanges, and valves for leaks","♦","♦","♦","♦","♦","♦","♦","♦","♦","♦","♦","♦","♦","♦","♦","♦","♦","♦"]
[null,"Inspect hardware for wear/damage","♦","♦","♦","♦","♦","♦","♦","♦","♦","♦","♦","♦","♦","♦","♦","♦","♦","♦"]
[null,"Grease pump motor bearings","♦","♦","♦","♦","♦","♦","♦","♦","♦","♦","♦","♦","♦","♦","♦","♦","♦","♦"]
[null,"Clean cabinet heat exchanger","♦","♦","♦","♦","♦","♦","♦","♦","♦","♦","♦","♦","♦","♦","♦","♦","♦","♦"]
[null,"Inspect for electrical wear/damage","♦","♦","♦","♦","♦","♦","♦","♦","♦","♦","♦","♦","♦","♦","♦","♦","♦","♦"]
{"$rows_left_out":34}
{"sheet":"release notes","index":13,"n_rows":9,"n_cols":3,"rows_kept":9,"cut":false,"hidden":true,"merged":[]}
["REV","DATE","release notes"]
[1,"2014-10-22","pre release to sales."]
[2,"2014-10-28","collapse/expander null rows functionality added"]
[3,"2014-11-04","single/dual currency modes added"]
[4,"2014-11-05","S6000 page collapse/expand null rows function collision with  single/dual currency corrected"]
[5]
[6]
[7]
{"$rows_left_out":2}
{"sheet":"Sheet1","index":14,"n_rows":0,"n_cols":0,"rows_kept":0,"cut":false,"hidden":false,"merged":[]}